Installation Error for ALSR - weblogic.support.install(Archived)

I am installing ALSR for evaluation and having issue during installation. Getting the following error, any help in resolving this issue would be appreciated.
The installation procedure has failed. The error message is:
The following error occurred while executing this line:
C:\AquaLogicServiceRegistry\etc\setup\porting.xml:93: The following error occurred while executing this line:
C:\AquaLogicServiceRegistry\conf\porting\build-ear-wl-7.xml:86: java.io.IOException: CreateProcess: C:\bea\null\bin\java weblogic.Deployer -adminurl t3://localhost:7001 -username weblogic -password sadmin -deploy -source C:\AquaLogicServiceRegistry/conf/porting/weblogic/build/registry.war -name registry error=3
Details of the failure were logged to file C:\AquaLogicServiceRegistry\log\install.log.
You may click Next to repeat the setup procedure or Exit to exit.
The install.log file has the following
---------------------------------------
props:
props2:
deploy:
port.weblogic.deploy:
Trying to override old definition of task input
deploy:
[echo] Deploying application...
BUILD FAILED
C:\AquaLogicServiceRegistry\etc\setup\porting.xml:393: The following error occurred while executing this line:
C:\AquaLogicServiceRegistry\etc\setup\porting.xml:93: The following error occurred while executing this line:
C:\AquaLogicServiceRegistry\conf\porting\build-ear-wl-7.xml:86: java.io.IOException: CreateProcess: C:\bea\null\bin\java weblogic.Deployer -adminurl t3://localhost:7001 -username weblogic -password sadmin -deploy -source C:\AquaLogicServiceRegistry/conf/porting/weblogic/build/registry.war -name registry error=3
Total time: 0 seconds 

Were you able to resolve the issue.
I am having same issue while installing AquaLogic Service Registry.

Related

Installation Issue : Oracle Service Registry 11.1.1 on weblogic 11g

I am getting installation error while trying to install the oracle service registry 11.1.1 on weblogic 11g .
below is the helpful " :) <: <: " message that I see the in the installation log.I dont know why oracle could not put useful installation error message in logs.
Any thought or suggests?
oracle.database.user=uddiuser
install.windows.menu=Oracle Service Registry 11.1.1
oracle.database.password=***
[java] BUILD FAILED
[java] C:\oracle\middleware\registry111\etc\setup\porting.xml:412: The following error occurred while executing this line:
[java] C:\oracle\middleware\registry111\etc\setup\porting.xml:350: The following error occurred while executing this line:
[java] C:\oracle\middleware\registry111\conf\porting\build-runner.xml:196: The following error occurred while executing this line:
[java] C:\oracle\middleware\registry111\conf\porting\build-runner.xml:202: The following error occurred while executing this line:
[java] C:\oracle\middleware\registry111\conf\porting\build-runner.xml:208: The following error occurred while executing this line:
[java] C:\oracle\middleware\registry111\conf\porting\build-ear.xml:257: The following error occurred while executing this line:
[java] C:\oracle\middleware\registry111\conf\porting\build-ear.xml:1031: The following error occurred while executing this line:
[java] C:\oracle\middleware\registry111\etc\setup\setupserver.xml:788: The following error occurred while executing this line:
[java] C:\oracle\middleware\registry111\etc\setup\setupserver.xml:774: Java returned: 1
[java] Total time: 3 minutes 8 seconds
Java returned: 1
Installation failed. If accessible, see "C:\oracle\middleware\registry111\log\install.log".
To correct installation parameters and resume installation click Recovery.
.
Edited by: user9214130 on Mar 24, 2011 3:02 PM 
same issue here.... I have tried to hack the installOracleDB.xml to print extra debug info, to no avail...
really frustrating. 
I we encountered the same issue. We overcame it by installing OSR on a weblogic domain which didnt have SOA suite installed as SOA was causing a conflict. Not sure if your domain contains SOA but if it does then you should try and create another domain for OSR only.
Hope this helps.
Regards.
Adrian 
Hi
Try to use the syntax "java-jar file.jar --debug" so you can see exactly what is wrong, and find real solution.
regards
AC

Problem to run the FOD Demo

When i Run Ant Target the "compile-deploy-all",it have problem,the problem are as follows:
BUILD FAILED
D:\FOD\CompositeServices\bin\build.xml:297: The following error occurred while executing this line:
D:\FOD\CompositeServices\OrderApprovalHumanTask\bin\build.xml:160: weblogic.Deployer$DeployerException: weblogic.deploy.api.tools.deployer.DeployerException: Task 1 failed: [Deployer:149026]deploy application OrderApprovalHumanTask on soa_server1.
Target state: deploy failed on Server soa_server1
weblogic.descriptor.BeanAlreadyExistsException: Bean already exists: "weblogic.j2ee.descriptor.wl.EjbReferenceDescriptionBeanImpl#70c11c08(/EjbReferenceDescriptions[ejb/bpel/services/workflow/TaskServiceBean])"

Loadjava Problem

When I tried to run the loadjava line:
loadjava -user jtfpartner/jtfpartner#jttias SSOHash.class
The following error message returns:
SQL Error while connecting with oci8 driver to jttias.: o$0
could not open connection
loadjava: 2 errors
Please help

Problem with OTN WebServices Demo: Online Store

Invoking OC4J admin tool...
C:\jdev9052\jdk\jre\bin\javaw.exe -jar C:\jdev9052\j2ee\home\admin.jar ormi://210.72.100.79 admin **** -deploy -file F:\shiyan\webservices\src\oracle\otnsamples\webservices\biz\webapp.ear -deploymentName WS-Demo
Error: Deploy error: deploy failed!: ; nested exception is:
     oracle.oc4j.admin.internal.DeployerException: Error parsing META-INF/application.xml in C:\oc4j_extended\j2ee\home\applications\WS-Demo: Fatal error at line 0 offset 0 in file:/C:/oc4j_extended/j2ee/home/applications/WS-Demo/: The encoding "GBK" is not support
I have amend the "GBK" setting of the project for UTF-8,but it still don't work.
thank you for helping

Problem with OTN WebServices Demo: Online Store

Invoking OC4J admin tool...
C:\jdev9052\jdk\jre\bin\javaw.exe -jar C:\jdev9052\j2ee\home\admin.jar ormi://210.72.100.79 admin **** -deploy -file F:\shiyan\webservices\src\oracle\otnsamples\webservices\biz\webapp.ear -deploymentName WS-Demo
Error: Deploy error: deploy failed!: ; nested exception is:
     oracle.oc4j.admin.internal.DeployerException: Error parsing META-INF/application.xml in C:\oc4j_extended\j2ee\home\applications\WS-Demo: Fatal error at line 0 offset 0 in file:/C:/oc4j_extended/j2ee/home/applications/WS-Demo/: The encoding "GBK" is not support
I have amend the "GBK" setting of the project for UTF-8,but it still don't work.
thank you for helping

Categories

Resources