OO4O & VC++ 4.0 - OO4O and Wizards(Archived)

Hi,
I would like to use OO40 in a VC++ 4.0 project.
I am using the version 8.1.6.3.13 for OO4O and Oracle 8i 8.1.6 Release 2 for Database.
I have included the needed libraries.
I have tried to compile the project, and I have got a lot of compilation errors into oracl.h file, like these:
c:\orant81\oo4o\cpp\include\Oracl.h(751) : error C2501: 'bool' : missing decl-specifiers
c:\orant81\oo4o\cpp\include\Oracl.h(751) : error C2146: syntax error : missing ';' before identifier 'GetAutoCommit'
c:\orant81\oo4o\cpp\include\Oracl.h(752) : error C2061: syntax error : identifier 'bool'
c:\orant81\oo4o\cpp\include\Oracl.h(788) : error C2146: syntax error : missing ';' before identifier 'OValue'
c:\orant81\oo4o\cpp\include\Oracl.h(790) : error C2146: syntax error : missing ';' before identifier 'OValue'
c:\orant81\oo4o\cpp\include\Oracl.h(792) : error C2146: syntax error : missing ';' before identifier 'OValue'
c:\orant81\oo4o\cpp\include\Oracl.h(795) : error C2146: syntax error : missing ';' before identifier 'OValue'
c:\orant81\oo4o\cpp\include\Oracl.h(1717) : error C2146: syntax error : missing ';' before identifier 'OServer'
c:\orant81\oo4o\cpp\include\Oracl.h(1720) : error C2146: syntax error : missing ';' before identifier 'OServer'
c:\orant81\oo4o\cpp\include\Oracl.h(1752) : error C2146: syntax error : missing ';' before identifier 'OObject'
c:\orant81\oo4o\cpp\include\Oracl.h(1754) : error C2144: syntax error : missing ';' before type 'int'
c:\orant81\oo4o\cpp\include\Oracl.h(1826) : error C2501: 'bool' : missing decl-specifiers
I have read the documentation of this version of OO4O and I know that it isn't compatible with VC++ 4.0. So, I would like to know:
Which is the compatible version of OO4O with VC++ 4.0?
Where can I find it?.
Please reply also to my e-mail.
Thank you a lot.
Bye.
Raul Serrano
Cordial Iberia S.L
E-mail: rserrano#humanet.es

Related

upgrading Portal from 10.1.2 to 10.1.4 error

i just followd exactly every step discribed in oracle installation 10.1.4 document,but yet upgrade failing.
the error dumped in screent during upgarding:
Error: Component upgrade failed PORTAL
Error: PORTAL component version is: 10.1.2.0.2 INVALID
the details error info in upgrade.err
ERROR at line 1:
ORA-29532: Java call terminated by uncaught Java exception:
ORA-06512: at "SYS.DBMS_JAVA", line 313
ORA-06512: at line 1
ORA-06512: at line 53
ORA-29521: referenced name com/sun/xml/rpc/streaming/XMLReaderException could not be found
ORA-29521: referenced name com/sun/xml/rpc/streaming/XMLReaderFactory could not be found
ORA-29521: referenced name com/sun/xml/rpc/streaming/XMLReader could not be found
ORA-29521: referenced name com/sun/xml/rpc/processor/model/exporter/Constants could not be found
ERROR at line 1:
ORA-29532: Java call terminated by uncaught Java exception: java.lang.NullPointerException
### ERROR: Exception Executing Script upg/common/predmasg/predmasg.pl :
Could any one give me any suggestion about this?
Thanks! 
You need patch number 4919248!!
See it in metalink!! 
i don't get your meanings.
The patch 4919248 is only applied on portal 10.1.4.0 according to the document from metalink,not 10.1.2.
The current version of my portal is 10.1.2,what i am trying to do is upgrading to 10.1.4!
Thank you anyway.
Message was edited by:
danny.li

ORA-28579: network error during callback from external procedure agent

Hi,
I am implementing a user defined aggregate function using ODCI and OCI in C(C++).
When I am executing a SQL command to call that external proc in C.
I am getting the following error:
ERROR at line 1:
ORA-28579: network error during callback from external procedure agent
Does any one know a fix or solution to this error ?
Please let me know.
Thanks,
-NN 
I was getting the following error :
*
ERROR at line 1:
ORA-06521: PL/SQL: Error mapping function
ORA-06522: /usr/lib/oracle/xe/app/oracle/product/10.2.0/server/lib/custagg.so:
undefined symbol: ODCIAggregateInitialize
then i added extern "C" keyword before each function signature in my C program but i am using unix(Linux) environment .. I don't know whether this extern "C" thing applies to unix or not.
After adding that I started getting the following network error :
ERROR at line 1:
ORA-28579: network error during callback from external procedure agent
Please let me know if any one of you have any solutions to these errors.
Thanks,
-NN

Error message while compiling

Hi!
I am trying to use Dynamic SQL in my report, when I tried compile I am getting the following error message.
Please can anyone tell me what I have to do.
STATEMENT:
dbms_sql.parse(v_cursorid, sel_str, dbms_sql.v7);
ERROR:
dbms_sql.parse(v_cursorid, sel_str, dbms_sql.v7);
Thanks. 
Sorry the error message was:
Error 302 at line 13, Column 47 component V7 must be declared.

OCI compilation with VC++6.0

I am trying to write a code to insert data into Oracle Spatial DB through OCI. Right now, I just wrote some basic functions using OCI, but when I compiled the code, there came fatal errors.
fatal error C1010: unexpected end of file while looking >for precompiled header directive
Error executing cl.exe.After I changed precompiled file option from /Yu to /YX, these error came.
----------------------------------------------
c:\oracle\ora92\oci\include\ort.h(761) : error C2065: 'OCIEnv' : undeclared identifier
c:\oracle\ora92\oci\include\ort.h(761) : error C2065: 'env' : undeclared identifier
c:\oracle\ora92\oci\include\ort.h(761) : error C2065: 'OCIError' : undeclared identifier
c:\oracle\ora92\oci\include\ort.h(761) : error C2065: 'err' : undeclared identifier
c:\oracle\ora92\oci\include\ort.h(761) : error C2065: 'tdo' : undeclared identifier
c:\oracle\ora92\oci\include\ort.h(761) : error C2275: 'OCIType' : illegal use of this type as an expression
c:\oracle\ora92\oci\include\ort.h(691) : see declaration of 'OCIType'
-------------------------
I included <oci.h> and <oci1.h>. I set OCI include directory and library directory correctly and added "oci.lib" and "ociw32.lib" into Link section. Could you help me to Long postings are being truncated to ~1 kB at this time.

CDS-18008 Error:

I am getting this:
CDS-18008 Error: An unexpected SGParameterException exception 'null argument' was raised in file ..\cddo\cddoie.cpp function cddoie_index_entry::cddoie_index_entry and line 132
when ever I try to generate the schema?

Categories

Resources